{"text_format":"1","workbook":"xlsx","n_sheets":5,"sheets":["Data","Intro","Calculate","Revision history","Simple Configurator for Install"],"not_rendered":{"charts":0,"images":6,"macros":1,"external_links":0,"defined_names":4,"comments":1,"pivot_tables":0},"unopened":[],"bounds":{"document_bytes":16777216,"sheet_cells":100000,"rows_first":2000,"rows_last":500,"rows_between":2000,"halvings":0,"cell_chars":16384,"cell_head_chars":4096},"cells_cut":0,"cells_raw":0,"read":"whole","date_system":"1900"}

{"sheet":"Data","index":0,"n_rows":20,"n_cols":14,"rows_kept":20,"cut":false,"hidden":true,"merged":[[25,7,25,8]]}
[]
["U0",48,"V","Voltage power source",null,null,null,null,"U0","Io","Power output"]
["Io",3,"A","Current Power source",null,null,null,null,null,null,"Watt",null,null,"A maximum of 22 nodes can be daisy-chained in the system this inlcudes all switches"]
["Power",{"$f":"B2*B3","v":144},"Watt","Total available power",null,null,null,null,48,3,{"$f":"I4*J4","v":144}]
["PCF's",2,"m ","Standard Cable length per device"]
["Rcon",10,"mOhm","Contact Resistance per contact"]
["Rcable",23,"ohm/km","Cable resistance one way"]
[]
["DCNM-MMD",11.3,"Watt","Power per device"]
["DCNM-MMD2",12,"Watt"]
["DCNM-DE",5,"Watt",null,null,null,null,"#of FLSP/FMCP/FSLP","# FMICB/FIDP/FVP/FAI"]
["DCNM-DSL",3.6,"Watt",null,"DCNM-FMICB/FPRIOB",0.4,"Watt",0,0]
["DCNM-DVT",3.7,"Watt",null,"DCNM-FMCP",0.2,"Watt",1,1]
["DCNM-D",3.1,"Watt",null,"DCNM-FLSP",1,"Watt",2,2]
["DCNM-IDESK",15,"Watt",null,"DCNM-FIDP",0.5,"Watt",null,3]
["DCNM-IDESKVID",18,"Watt",null,"DCNM-FVP",0.5,"Watt",null,4]
["DCNM-FBD2",5,"Watt",null,"DCNM-FAI",0.5,"Watt"]
["INT-TXO",10,"Watt",null,"DCNM-FSLP",0.5,"Watt"]
["DCNM-ENCD",2,"Watt"]
["DCNM-ENCS",2,"Watt"]

{"sheet":"Intro","index":1,"n_rows":22,"n_cols":2,"rows_kept":22,"cut":false,"hidden":false,"merged":[]}
["DICENTIS Power Calculation Tool"]
["Version",213]
["Date","2025-06-25"]
[]
[]
[]
[]
[]
[]
[]
[]
[]
[]
[]
[]
[]
[]
[]
["Click the hyperlink of either meters or feet to enter the calculation sheet."]
["Enter the required cable length and the calculation will show you in red if the cable is too long."]
["Clearing the cable length cell will remove the complete line"]
["Have fun using this tool."]

{"sheet":"Calculate","index":2,"n_rows":43,"n_cols":22,"rows_kept":43,"cut":false,"hidden":false,"merged":[[0,3,0,9]]}
[null,null,null,"attached modules to FBD2 (total on both outputs)",null,null,null,null,null,null,"Length","P device W","CB resistance"," U device V","Iload (mA)","In (A)","V too low","I too low",null,null,{"$f":"NOW()","v":"2026-03-24T12:37:12.310"}]
["Device","Cable length (m) between 2-99","Device type","DCNM-FLSP","DCNM-FMICB / DCNM-FPRIOB","DCNM-FMCP","DCNM-FIDP","DCNM-FVP","DCNM- FSLP","DCNM-FAI","m",3.2808399000000001,null,{"$f":"Data!$B$2","v":48},null,3,{"$f":"IFERROR(MATCH(1,Q3:Q43,0),)","v":41},{"$f":"IFERROR(MATCH(1,R3:R43,0),)","v":31},null,3,41,41]
[1,2,"DCNM-DE",null,null,null,null,null,null,null,{"$f":"IF($K$2=\"m\",B3,INT(B3/3.2808399+0.5))","v":2},{"$f":"IF(ISBLANK(C3),\"\",VLOOKUP(C3,Data!$A$9:$B$20,2,FALSE)+IF(C3=\"DCNM-FBD2\",D3*Data!$F$14+E3*Data!$F$12+F3*Data!$F$13+G3*Data!$F$15+H3*Data!$F$16+I3*Data!$F$17+J3*Data!$F$18,0))","v":5},{"$f":"IF(OR(COUNTBLANK(K3)>0,COUNTBLANK(L3)>0),\"\",2*(Data!$B$7/1000)*K3+ 4*Data!$B$6/1000)","v":0.13200000000000001},{"$f":"IF(COUNTBLANK(M3)>0,\"\",N2-(P2*M3))","v":47.603999999999999},{"$f":"IF(COUNTBLANK(N3)>0,\"\",(L3/N3)*1000)","v":105.03319048819428},{"$f":"IF(COUNTBLANK(O3)>0,\"\",P2-O2/1000)","v":3},{"$f":"IFERROR(IF(LEFT(C3,6)=\"DCNM-D\",IF((N3<35),1,0),IF((N3<31),1,0)),)","v":0},{"$f":"IFERROR(IF(P3<O3/1000,1,0),)","v":0},{"$f":"Q3+R3","v":0},3,41,41]
[2,2,"DCNM-DE",null,null,null,null,null,null,null,2,{"$f":"IF(ISBLANK(C4),\"\",VLOOKUP(C4,Data!$A$9:$B$20,2,FALSE)+IF(C4=\"DCNM-FBD2\",D4*Data!$F$14+E4*Data!$F$12+F4*Data!$F$13+G4*Data!$F$15+H4*Data!$F$16+I4*Data!$F$17+J4*Data!$F$18,0))","v":5},{"$f":"IF(OR(COUNTBLANK(K4)>0,COUNTBLANK(L4)>0),\"\",2*(Data!$B$7/1000)*K4+ 4*Data!$B$6/1000)","v":0.13200000000000001},{"$f":"IF(COUNTBLANK(M4)>0,\"\",N3-(P3*M4))","v":47.207999999999998},{"$f":"IF(COUNTBLANK(N4)>0,\"\",(L4/N4)*1000)","v":105.91425182172513},{"$f":"IF(COUNTBLANK(O4)>0,\"\",P3-O3/1000)","v":2.8949668095118057},0,{"$f":"IFERROR(IF(P4<O4/1000,1,0),)","v":0},{"$f":"Q4+R4+SUM($S$3:S3)","v":0},3,41,41]
[3,2,"DCNM-DE",null,null,null,null,null,null,null,2,{"$f":"IF(ISBLANK(C5),\"\",VLOOKUP(C5,Data!$A$9:$B$20,2,FALSE)+IF(C5=\"DCNM-FBD2\",D5*Data!$F$14+E5*Data!$F$12+F5*Data!$F$13+G5*Data!$F$15+H5*Data!$F$16+I5*Data!$F$17+J5*Data!$F$18,0))","v":5},{"$f":"IF(OR(COUNTBLANK(K5)>0,COUNTBLANK(L5)>0),\"\",2*(Data!$B$7/1000)*K5+ 4*Data!$B$6/1000)","v":0.13200000000000001},{"$f":"IF(COUNTBLANK(M5)>0,\"\",N4-(P4*M5))","v":46.825864381144441},{"$f":"IF(COUNTBLANK(N5)>0,\"\",(L5/N5)*1000)","v":106.77859482319283},{"$f":"IF(COUNTBLANK(O5)>0,\"\",P4-O4/1000)","v":2.7890525576900806},0,{"$f":"IFERROR(IF(P5<O5/1000,1,0),)","v":0},{"$f":"Q5+R5+SUM($S$3:S4)","v":0}]
[4,2,"DCNM-DE",null,null,null,null,null,null,null,2,{"$f":"IF(ISBLANK(C6),\"\",VLOOKUP(C6,Data!$A$9:$B$20,2,FALSE)+IF(C6=\"DCNM-FBD2\",D6*Data!$F$14+E6*Data!$F$12+F6*Data!$F$13+G6*Data!$F$15+H6*Data!$F$16+I6*Data!$F$17+J6*Data!$F$18,0))","v":5},{"$f":"IF(OR(COUNTBLANK(K6)>0,COUNTBLANK(L6)>0),\"\",2*(Data!$B$7/1000)*K6+ 4*Data!$B$6/1000)","v":0.13200000000000001},46.457709443529353,107.6247636805607,2.6822739628668879,0,0,{"$f":"Q6+R6+SUM($S$3:S5)","v":0}]
[5,2,"DCNM-DE",null,null,null,null,null,null,null,2,{"$f":"IF(ISBLANK(C7),\"\",VLOOKUP(C7,Data!$A$9:$B$20,2,FALSE)+IF(C7=\"DCNM-FBD2\",D7*Data!$F$14+E7*Data!$F$12+F7*Data!$F$13+G7*Data!$F$15+H7*Data!$F$16+I7*Data!$F$17+J7*Data!$F$18,0))","v":5},{"$f":"IF(OR(COUNTBLANK(K7)>0,COUNTBLANK(L7)>0),\"\",2*(Data!$B$7/1000)*K7+ 4*Data!$B$6/1000)","v":0.13200000000000001},46.103649280430922,108.45128483402488,2.5746491991863274,0,0,{"$f":"Q7+R7+SUM($S$3:S6)","v":0}]
[6,2,"DCNM-DE",null,null,null,null,null,null,null,2,{"$f":"IF(ISBLANK(C8),\"\",VLOOKUP(C8,Data!$A$9:$B$20,2,FALSE)+IF(C8=\"DCNM-FBD2\",D8*Data!$F$14+E8*Data!$F$12+F8*Data!$F$13+G8*Data!$F$15+H8*Data!$F$16+I8*Data!$F$17+J8*Data!$F$18,0))","v":5},{"$f":"IF(OR(COUNTBLANK(K8)>0,COUNTBLANK(L8)>0),\"\",2*(Data!$B$7/1000)*K8+ 4*Data!$B$6/1000)","v":0.13200000000000001},45.763795586138329,109.25667191631456,2.4661979143523025,0,0,{"$f":"Q8+R8+SUM($S$3:S7)","v":0}]
[7,2,"DCNM-DE",null,null,null,null,null,null,null,2,{"$f":"IF(ISBLANK(C9),\"\",VLOOKUP(C9,Data!$A$9:$B$20,2,FALSE)+IF(C9=\"DCNM-FBD2\",D9*Data!$F$14+E9*Data!$F$12+F9*Data!$F$13+G9*Data!$F$15+H9*Data!$F$16+I9*Data!$F$17+J9*Data!$F$18,0))","v":5},{"$f":"IF(OR(COUNTBLANK(K9)>0,COUNTBLANK(L9)>0),\"\",2*(Data!$B$7/1000)*K9+ 4*Data!$B$6/1000)","v":0.13200000000000001},45.438257461443825,110.03943107287289,2.3569412424359881,0,0,{"$f":"Q9+R9+SUM($S$3:S8)","v":0}]
[8,2,"DCNM-DE",null,null,null,null,null,null,null,2,{"$f":"IF(ISBLANK(C10),\"\",VLOOKUP(C10,Data!$A$9:$B$20,2,FALSE)+IF(C10=\"DCNM-FBD2\",D10*Data!$F$14+E10*Data!$F$12+F10*Data!$F$13+G10*Data!$F$15+H10*Data!$F$16+I10*Data!$F$17+J10*Data!$F$18,0))","v":5},{"$f":"IF(OR(COUNTBLANK(K10)>0,COUNTBLANK(L10)>0),\"\",2*(Data!$B$7/1000)*K10+ 4*Data!$B$6/1000)","v":0.13200000000000001},45.127141217442272,110.79806664259578,2.2469018113631152,0,0,{"$f":"Q10+R10+SUM($S$3:S9)","v":0}]
[9,2,"DCNM-DE",null,null,null,null,null,null,null,2,{"$f":"IF(ISBLANK(C11),\"\",VLOOKUP(C11,Data!$A$9:$B$20,2,FALSE)+IF(C11=\"DCNM-FBD2\",D11*Data!$F$14+E11*Data!$F$12+F11*Data!$F$13+G11*Data!$F$15+H11*Data!$F$16+I11*Data!$F$17+J11*Data!$F$18,0))","v":5},{"$f":"IF(OR(COUNTBLANK(K11)>0,COUNTBLANK(L11)>0),\"\",2*(Data!$B$7/1000)*K11+ 4*Data!$B$6/1000)","v":0.13200000000000001},44.830550178342342,111.5310871740205,2.1361037447205193,0,0,{"$f":"Q11+R11+SUM($S$3:S10)","v":0}]
[10,2,"DCNM-DE",null,null,null,null,null,null,null,2,{"$f":"IF(ISBLANK(C12),\"\",VLOOKUP(C12,Data!$A$9:$B$20,2,FALSE)+IF(C12=\"DCNM-FBD2\",D12*Data!$F$14+E12*Data!$F$12+F12*Data!$F$13+G12*Data!$F$15+H12*Data!$F$16+I12*Data!$F$17+J12*Data!$F$18,0))","v":5},{"$f":"IF(OR(COUNTBLANK(K12)>0,COUNTBLANK(L12)>0),\"\",2*(Data!$B$7/1000)*K12+ 4*Data!$B$6/1000)","v":0.13200000000000001},44.548584484039232,112.23701174593749,2.0245726575464991,0,0,{"$f":"Q12+R12+SUM($S$3:S11)","v":0}]
[11,2,"DCNM-DE",null,null,null,null,null,null,null,2,{"$f":"IF(ISBLANK(C13),\"\",VLOOKUP(C13,Data!$A$9:$B$20,2,FALSE)+IF(C13=\"DCNM-FBD2\",D13*Data!$F$14+E13*Data!$F$12+F13*Data!$F$13+G13*Data!$F$15+H13*Data!$F$16+I13*Data!$F$17+J13*Data!$F$18,0))","v":5},{"$f":"IF(OR(COUNTBLANK(K13)>0,COUNTBLANK(L13)>0),\"\",2*(Data!$B$7/1000)*K13+ 4*Data!$B$6/1000)","v":0.13200000000000001},44.281340893243097,112.91437655545231,1.9123356458005616,0,0,{"$f":"Q13+R13+SUM($S$3:S12)","v":0}]
[12,2,"DCNM-DE",null,null,null,null,null,null,null,2,{"$f":"IF(ISBLANK(C14),\"\",VLOOKUP(C14,Data!$A$9:$B$20,2,FALSE)+IF(C14=\"DCNM-FBD2\",D14*Data!$F$14+E14*Data!$F$12+F14*Data!$F$13+G14*Data!$F$15+H14*Data!$F$16+I14*Data!$F$17+J14*Data!$F$18,0))","v":5},{"$f":"IF(OR(COUNTBLANK(K14)>0,COUNTBLANK(L14)>0),\"\",2*(Data!$B$7/1000)*K14+ 4*Data!$B$6/1000)","v":0.13200000000000001},44.028912587997425,113.56174173066071,1.7994212692451093,0,0,{"$f":"Q14+R14+SUM($S$3:S13)","v":0}]
[13,2,"DCNM-DE",null,null,null,null,null,null,null,2,{"$f":"IF(ISBLANK(C15),\"\",VLOOKUP(C15,Data!$A$9:$B$20,2,FALSE)+IF(C15=\"DCNM-FBD2\",D15*Data!$F$14+E15*Data!$F$12+F15*Data!$F$13+G15*Data!$F$15+H15*Data!$F$16+I15*Data!$F$17+J15*Data!$F$18,0))","v":5},{"$f":"IF(OR(COUNTBLANK(K15)>0,COUNTBLANK(L15)>0),\"\",2*(Data!$B$7/1000)*K15+ 4*Data!$B$6/1000)","v":0.13200000000000001},43.791388980457072,114.17769831944281,1.6858595275144486,0,0,{"$f":"Q15+R15+SUM($S$3:S14)","v":0}]
[14,2,"DCNM-DE",null,null,null,null,null,null,null,2,{"$f":"IF(ISBLANK(C16),\"\",VLOOKUP(C16,Data!$A$9:$B$20,2,FALSE)+IF(C16=\"DCNM-FBD2\",D16*Data!$F$14+E16*Data!$F$12+F16*Data!$F$13+G16*Data!$F$15+H16*Data!$F$16+I16*Data!$F$17+J16*Data!$F$18,0))","v":5},{"$f":"IF(OR(COUNTBLANK(K16)>0,COUNTBLANK(L16)>0),\"\",2*(Data!$B$7/1000)*K16+ 4*Data!$B$6/1000)","v":0.13200000000000001},43.568855522825167,114.76087540056139,1.5716818291950057,0,0,{"$f":"Q16+R16+SUM($S$3:S15)","v":0}]
[15,2,"DCNM-DE",null,null,null,null,null,null,null,2,{"$f":"IF(ISBLANK(C17),\"\",VLOOKUP(C17,Data!$A$9:$B$20,2,FALSE)+IF(C17=\"DCNM-FBD2\",D17*Data!$F$14+E17*Data!$F$12+F17*Data!$F$13+G17*Data!$F$15+H17*Data!$F$16+I17*Data!$F$17+J17*Data!$F$18,0))","v":5},{"$f":"IF(OR(COUNTBLANK(K17)>0,COUNTBLANK(L17)>0),\"\",2*(Data!$B$7/1000)*K17+ 4*Data!$B$6/1000)","v":0.13200000000000001},43.361393521371426,115.30994725839847,1.4569209537944443,0,0,{"$f":"Q17+R17+SUM($S$3:S16)","v":0}]
[16,2,"DCNM-DE",null,null,null,null,null,null,null,2,{"$f":"IF(ISBLANK(C18),\"\",VLOOKUP(C18,Data!$A$9:$B$20,2,FALSE)+IF(C18=\"DCNM-FBD2\",D18*Data!$F$14+E18*Data!$F$12+F18*Data!$F$13+G18*Data!$F$15+H18*Data!$F$16+I18*Data!$F$17+J18*Data!$F$18,0))","v":5},{"$f":"IF(OR(COUNTBLANK(K18)>0,COUNTBLANK(L18)>0),\"\",2*(Data!$B$7/1000)*K18+ 4*Data!$B$6/1000)","v":0.13200000000000001},43.169079955470558,115.82364055841732,1.3416110065360458,0,0,{"$f":"Q18+R18+SUM($S$3:S17)","v":0}]
[17,2,"DCNM-DE",null,null,null,null,null,null,null,2,{"$f":"IF(ISBLANK(C19),\"\",VLOOKUP(C19,Data!$A$9:$B$20,2,FALSE)+IF(C19=\"DCNM-FBD2\",D19*Data!$F$14+E19*Data!$F$12+F19*Data!$F$13+G19*Data!$F$15+H19*Data!$F$16+I19*Data!$F$17+J19*Data!$F$18,0))","v":5},{"$f":"IF(OR(COUNTBLANK(K19)>0,COUNTBLANK(L19)>0),\"\",2*(Data!$B$7/1000)*K19+ 4*Data!$B$6/1000)","v":0.13200000000000001},42.991987302607797,116.30074145692519,1.2257873659776286,0,0,{"$f":"Q19+R19+SUM($S$3:S18)","v":0}]
[18,2,"DCNM-DE",null,null,null,null,null,null,null,2,{"$f":"IF(ISBLANK(C20),\"\",VLOOKUP(C20,Data!$A$9:$B$20,2,FALSE)+IF(C20=\"DCNM-FBD2\",D20*Data!$F$14+E20*Data!$F$12+F20*Data!$F$13+G20*Data!$F$15+H20*Data!$F$16+I20*Data!$F$17+J20*Data!$F$18,0))","v":5},{"$f":"IF(OR(COUNTBLANK(K20)>0,COUNTBLANK(L20)>0),\"\",2*(Data!$B$7/1000)*K20+ 4*Data!$B$6/1000)","v":0.13200000000000001},42.830183370298748,116.74010257605686,1.1094866245207033,0,0,{"$f":"Q20+R20+SUM($S$3:S19)","v":0}]
[19,2,"DCNM-DE",null,null,null,null,null,null,null,2,{"$f":"IF(ISBLANK(C21),\"\",VLOOKUP(C21,Data!$A$9:$B$20,2,FALSE)+IF(C21=\"DCNM-FBD2\",D21*Data!$F$14+E21*Data!$F$12+F21*Data!$F$13+G21*Data!$F$15+H21*Data!$F$16+I21*Data!$F$17+J21*Data!$F$18,0))","v":5},{"$f":"IF(OR(COUNTBLANK(K21)>0,COUNTBLANK(L21)>0),\"\",2*(Data!$B$7/1000)*K21+ 4*Data!$B$6/1000)","v":0.13200000000000001},42.683731135862018,117.14064977321301,0.99274652194464652,0,0,{"$f":"Q21+R21+SUM($S$3:S20)","v":0}]
[20,2,"DCNM-D",null,null,null,null,null,null,null,2,{"$f":"IF(ISBLANK(C22),\"\",VLOOKUP(C22,Data!$A$9:$B$20,2,FALSE)+IF(C22=\"DCNM-FBD2\",D22*Data!$F$14+E22*Data!$F$12+F22*Data!$F$13+G22*Data!$F$15+H22*Data!$F$16+I22*Data!$F$17+J22*Data!$F$18,0))","v":3.1},{"$f":"IF(OR(COUNTBLANK(K22)>0,COUNTBLANK(L22)>0),\"\",2*(Data!$B$7/1000)*K22+ 4*Data!$B$6/1000)","v":0.13200000000000001},42.552688594965325,72.850860952809001,0.87560587217143349,0,0,{"$f":"Q22+R22+SUM($S$3:S21)","v":0}]
[21,2,"DCNM-D",null,null,null,null,null,null,null,2,{"$f":"IF(ISBLANK(C23),\"\",VLOOKUP(C23,Data!$A$9:$B$20,2,FALSE)+IF(C23=\"DCNM-FBD2\",D23*Data!$F$14+E23*Data!$F$12+F23*Data!$F$13+G23*Data!$F$15+H23*Data!$F$16+I23*Data!$F$17+J23*Data!$F$18,0))","v":3.1},{"$f":"IF(OR(COUNTBLANK(K23)>0,COUNTBLANK(L23)>0),\"\",2*(Data!$B$7/1000)*K23+ 4*Data!$B$6/1000)","v":0.13200000000000001},42.437108619838696,73.049274581133872,0.80275501121862447,0,0,{"$f":"Q23+R23+SUM($S$3:S22)","v":0}]
[22,2,"DCNM-D",null,null,null,null,null,null,null,2,{"$f":"IF(ISBLANK(C24),\"\",VLOOKUP(C24,Data!$A$9:$B$20,2,FALSE)+IF(C24=\"DCNM-FBD2\",D24*Data!$F$14+E24*Data!$F$12+F24*Data!$F$13+G24*Data!$F$15+H24*Data!$F$16+I24*Data!$F$17+J24*Data!$F$18,0))","v":3.1},{"$f":"IF(OR(COUNTBLANK(K24)>0,COUNTBLANK(L24)>0),\"\",2*(Data!$B$7/1000)*K24+ 4*Data!$B$6/1000)","v":0.13200000000000001},42.331144958357839,73.232132110991671,0.72970573663749061,0,0,{"$f":"Q24+R24+SUM($S$3:S23)","v":0}]
[23,2,"DCNM-D",null,null,null,null,null,null,null,2,{"$f":"IF(ISBLANK(C25),\"\",VLOOKUP(C25,Data!$A$9:$B$20,2,FALSE)+IF(C25=\"DCNM-FBD2\",D25*Data!$F$14+E25*Data!$F$12+F25*Data!$F$13+G25*Data!$F$15+H25*Data!$F$16+I25*Data!$F$17+J25*Data!$F$18,0))","v":3.1},{"$f":"IF(OR(COUNTBLANK(K25)>0,COUNTBLANK(L25)>0),\"\",2*(Data!$B$7/1000)*K25+ 4*Data!$B$6/1000)","v":0.13200000000000001},42.234823801121692,73.399146036396374,0.65647360452649894,0,0,{"$f":"Q25+R25+SUM($S$3:S24)","v":0}]
[24,2,"DCNM-D",null,null,null,null,null,null,null,2,{"$f":"IF(ISBLANK(C26),\"\",VLOOKUP(C26,Data!$A$9:$B$20,2,FALSE)+IF(C26=\"DCNM-FBD2\",D26*Data!$F$14+E26*Data!$F$12+F26*Data!$F$13+G26*Data!$F$15+H26*Data!$F$16+I26*Data!$F$17+J26*Data!$F$18,0))","v":3.1},{"$f":"IF(OR(COUNTBLANK(K26)>0,COUNTBLANK(L26)>0),\"\",2*(Data!$B$7/1000)*K26+ 4*Data!$B$6/1000)","v":0.13200000000000001},42.148169285324194,73.550050988321487,0.58307445849010253,0,0,{"$f":"Q26+R26+SUM($S$3:S25)","v":0}]
[25,2,"DCNM-D",null,null,null,null,null,null,null,2,{"$f":"IF(ISBLANK(C27),\"\",VLOOKUP(C27,Data!$A$9:$B$20,2,FALSE)+IF(C27=\"DCNM-FBD2\",D27*Data!$F$14+E27*Data!$F$12+F27*Data!$F$13+G27*Data!$F$15+H27*Data!$F$16+I27*Data!$F$17+J27*Data!$F$18,0))","v":3.1},{"$f":"IF(OR(COUNTBLANK(K27)>0,COUNTBLANK(L27)>0),\"\",2*(Data!$B$7/1000)*K27+ 4*Data!$B$6/1000)","v":0.13200000000000001},42.071203456803502,73.684604795841338,0.50952440750178107,0,0,{"$f":"Q27+R27+SUM($S$3:S26)","v":0}]
[26,2,"DCNM-D",null,null,null,null,null,null,null,2,{"$f":"IF(ISBLANK(C28),\"\",VLOOKUP(C28,Data!$A$9:$B$20,2,FALSE)+IF(C28=\"DCNM-FBD2\",D28*Data!$F$14+E28*Data!$F$12+F28*Data!$F$13+G28*Data!$F$15+H28*Data!$F$16+I28*Data!$F$17+J28*Data!$F$18,0))","v":3.1},{"$f":"IF(OR(COUNTBLANK(K28)>0,COUNTBLANK(L28)>0),\"\",2*(Data!$B$7/1000)*K28+ 4*Data!$B$6/1000)","v":0.13200000000000001},42.003946235013267,73.802589467556516,0.43583980270593975,0,0,{"$f":"Q28+R28+SUM($S$3:S27)","v":0}]
[27,2,"DCNM-D",null,null,null,null,null,null,null,2,{"$f":"IF(ISBLANK(C29),\"\",VLOOKUP(C29,Data!$A$9:$B$20,2,FALSE)+IF(C29=\"DCNM-FBD2\",D29*Data!$F$14+E29*Data!$F$12+F29*Data!$F$13+G29*Data!$F$15+H29*Data!$F$16+I29*Data!$F$17+J29*Data!$F$18,0))","v":3.1},{"$f":"IF(OR(COUNTBLANK(K29)>0,COUNTBLANK(L29)>0),\"\",2*(Data!$B$7/1000)*K29+ 4*Data!$B$6/1000)","v":0.13200000000000001},41.946415381056084,73.903812085931605,0.36203721323838323,0,0,{"$f":"Q29+R29+SUM($S$3:S28)","v":0}]
[28,2,"DCNM-D",null,null,null,null,null,null,null,2,{"$f":"IF(ISBLANK(C30),\"\",VLOOKUP(C30,Data!$A$9:$B$20,2,FALSE)+IF(C30=\"DCNM-FBD2\",D30*Data!$F$14+E30*Data!$F$12+F30*Data!$F$13+G30*Data!$F$15+H30*Data!$F$16+I30*Data!$F$17+J30*Data!$F$18,0))","v":3.1},{"$f":"IF(OR(COUNTBLANK(K30)>0,COUNTBLANK(L30)>0),\"\",2*(Data!$B$7/1000)*K30+ 4*Data!$B$6/1000)","v":0.13200000000000001},41.898626468908617,73.988105607719447,0.28813340115245162,0,0,{"$f":"Q30+R30+SUM($S$3:S29)","v":0}]
{"$rows_left_out":14}
{"sheet":"Revision history","index":3,"n_rows":17,"n_cols":4,"rows_kept":17,"cut":false,"hidden":true,"merged":[]}
[]
["Version","Date","Author","Comment"]
[1,"2014-06-16","Sjack Schellekens","Initial version"]
["1.01","2014-07-16","Jeroen de Graauw","Added revision history tab, and modified column width 'Calculate'B by splitting Cable Length over 2 lines"]
["1.02","2014-10-14","Derk-Jan Elshout","added Feet"]
["2.00","2016-03-10","Sjack Schellekens","Created master file with automatic protect feature"]
["2.01","2016-05-26","Sjack Schellekens","Change to Marco file version to handle different devices"]
["2.04","2018-04-21","Sjack Schellekens","Added interpreter desk"]
["2.05","2018-09-20","Sjack Schellekens","Improved initial state, so it will start with an empty list"]
["2.06","2019-10-24","Sjack Schellekens","Change data validation 2-99 for meters and 6-325 for feet, initial list changed to DCNM-D"]
["2.07","2020-04-09","Sjack Schellekens","Fixed maximum check for imperial measures"]
["2.08","2021-03-22","Tim Vriends","Added FBD + modules"]
["2.09","2022-10-10","Tim Vriends","Added flush ph2 and TXO"]
["2.10","2024-09-27","Tim Vriends","Correct errors wrt #of FAI and FVPs (changed from 2 to 4)"]
["2.11","2025-01-24","Tim Vriends","Added nameplates"]
["2.12","2025-03-07","Tim Vriends","resolved bug wrt meter/feet conversion"]
["2.13","2025-06-25","Derk-Jan Elshout","added FLS2 calculation page"]

{"sheet":"Simple Configurator for Install","index":4,"n_rows":138,"n_cols":34,"rows_kept":138,"cut":false,"hidden":false,"merged":[[62,15,62,16],[63,15,63,16],[68,7,68,9],[96,7,96,9],[96,10,96,11],[89,7,89,14],[91,7,91,9],[93,7,93,9],[94,7,94,9],[95,7,95,9],[95,10,95,11],[69,7,69,9],[13,0,13,2],[14,0,14,2],[49,7,52,7],[49,8,52,8],[53,7,56,7],[53,8,56,8],[57,7,60,7],[57,8,60,8],[8,0,8,2],[8,3,8,4],[0,0,0,4],[1,0,1,4],[5,0,5,2],[6,0,6,2],[7,0,7,2]]}
["Flush Language Selector 2",null,null,null,null,null,null,"Class","PClass\n[W]","PClass_PD [W]","VPSE_min\n[V]","VPSE_max\n[V]","Number of pairs","PCable_max\n[W]","Loss\n[%]","Rcable\n[Ω]","Icable\n[A]","Vcable\n[V]","VPD\n[V]"]
["Device number calculation tool",null,null,null,null,null,null,0,15.4,12.94,44,57,2,{"$f":"I2-J2","v":2.4600000000000009},{"$f":"N2/I2","v":0.15974025974025979},{"$f":"(N2*K2^2)/(N2^2+2*N2*J2+J2^2)","v":20.081632653061231},{"$f":"(K2-SQRT(K2^2-4*P2*J2))/(2*P2)","v":0.35},{"$f":"P2*Q2","v":7.0285714285714302},{"$f":"K2-R2","v":36.971428571428568}]
[null,null,null,null,null,null,null,1,4,3.84,44,57,2,0.16000000000000014,4.0000000000000036E-2,19.360000000000017,9.0909090909090912E-2,1.7600000000000016,42.239999999999995]
[null,null,null,null,null,null,null,2,7,6.49,44,57,2,0.50999999999999979,7.2857142857142829E-2,20.150204081632644,0.15909090909090901,3.2057142857142824,40.794285714285721]
["INPUT",null,null,null,null,null,null,3,15.4,12.95,44,57,2,2.4500000000000011,0.15909090909090914,20.000000000000004,0.35000000000000003,7.0000000000000018,37]
[null,null,null,"Value","Units",null,null,4,30,25.5,50,57,2,4.5,0.15,12.5,0.6,7.5,42.5]
["Cable length from PSE (PoE switch) to 1st device:",null,null,100,"m",null,null,5,45,40,50,57,4,5,0.1111111111111111,6.1728395061728394,0.89999999999999969,5.5555555555555536,44.444444444444443]
["Cable length between devices:",null,null,2,"m",null,null,6,60,51,50,57,4,9,0.15,6.25,1.2,7.5,42.5]
[null,null,null,"CAT6",null,null,null,7,75,62,50,57,4,13,0.17333333333333334,5.7777777777777777,1.5000000000000002,8.6666666666666679,41.333333333333329]
["Wire Gauge",null,null,22,"AWG","(22, …, 26)",null,8,90,71.3,52,57,4,18.700000000000003,0.20777777777777781,6.242567901234569,1.7307692307692311,10.804444444444448,41.195555555555551]
["PoE class",null,null,6,null,"(0, …, 6)"]
[]
["OUTPUT"]
["Maximum number of allowed devices:",null,null,{"$f":"'Simple Configurator for Install'!K132","v":18}]
["Total cable length required:",null,null,{"$f":"'Simple Configurator for Install'!K133","v":134},"m"]
[]
[]
[]
[]
[]
[]
[]
[]
[]
[]
[]
[]
[]
[]
[]
{"$rows_left_out":108}